Reaction Details
TargetPlatelet-derived growth factor receptor beta
LigandBDBM50362079
Substrate/Competitorn/a
Meas. Tech.ChEMBL_797353 (CHEMBL1942929)
IC50>1000±n/a nM
Citation Plé, PAJung, FAshton, SHennequin, LLaine, RMorgentin, RPasquet, GTaylor, S Discovery of AZD2932, a new Quinazoline Ether Inhibitor with high affinity for VEGFR-2 and PDGFR tyrosine kinases. Bioorg Med Chem Lett22:262-6 (2011) 
 
Platelet-derived growth factor receptor beta
Name:Platelet-derived growth factor receptor beta
Type:Enzyme
Mol. Mass.:123922.25
Organism:Homo sapiens (Human)
Description:P09619
Residue:1106
BDBM50362079
NameBDBM50362079
Synonyms:CHEMBL1940263
TypeSmall organic molecule
Emp. Form.C24H23N3O6S
Mol. Mass.481.521
SMILESCOc1cccc(c1)S(=O)(=O)NCc1ccc(Oc2ncnc3cc(OC)c(OC)cc23)cc1