Reaction Details
TargetMacrophage colony-stimulating factor 1 receptor
LigandBDBM50362060
Substrate/Competitorn/a
Meas. Tech.ChEMBL_797355 (CHEMBL1942931)
IC50 600±n/a nM
Citation Plé, PAJung, FAshton, SHennequin, LLaine, RMorgentin, RPasquet, GTaylor, S Discovery of AZD2932, a new Quinazoline Ether Inhibitor with high affinity for VEGFR-2 and PDGFR tyrosine kinases. Bioorg Med Chem Lett22:262-6 (2011) 
 
Macrophage colony-stimulating factor 1 receptor
Name:Macrophage colony-stimulating factor 1 receptor
Type:Protein
Mol. Mass.:107979.48
Organism:Homo sapiens (Human)
Description:P07333
Residue:972
BDBM50362060
NameBDBM50362060
Synonyms:CHEMBL1940105
TypeSmall organic molecule
Emp. Form.C23H25N7O3
Mol. Mass.447.4897
SMILESCOc1cc2ncnc(Nc3cnn(CC(=O)Nc4ccc(cc4)N(C)C)c3)c2cc1OC