Reaction Details
TargetMacrophage colony-stimulating factor 1 receptor
LigandBDBM50362076
Substrate/Competitorn/a
Meas. Tech.ChEMBL_797355 (CHEMBL1942931)
IC50>1000±n/a nM
Citation Plé, PAJung, FAshton, SHennequin, LLaine, RMorgentin, RPasquet, GTaylor, S Discovery of AZD2932, a new Quinazoline Ether Inhibitor with high affinity for VEGFR-2 and PDGFR tyrosine kinases. Bioorg Med Chem Lett22:262-6 (2011) 
 
Macrophage colony-stimulating factor 1 receptor
Name:Macrophage colony-stimulating factor 1 receptor
Type:Protein
Mol. Mass.:107979.48
Organism:Homo sapiens (Human)
Description:P07333
Residue:972
BDBM50362076
NameBDBM50362076
Synonyms:CHEMBL1940260
TypeSmall organic molecule
Emp. Form.C25H24N4O4
Mol. Mass.444.4825
SMILESCOc1cccc(NC(=O)Cc2ccc(Nc3ncnc4cc(OC)c(OC)cc34)cc2)c1