Reaction Details
TargetReceptor-type tyrosine-protein kinase FLT3
LigandBDBM50362083
Substrate/Competitorn/a
Meas. Tech.ChEMBL_797357 (CHEMBL1942933)
IC50 20±n/a nM
Citation Plé, PAJung, FAshton, SHennequin, LLaine, RMorgentin, RPasquet, GTaylor, S Discovery of AZD2932, a new Quinazoline Ether Inhibitor with high affinity for VEGFR-2 and PDGFR tyrosine kinases. Bioorg Med Chem Lett22:262-6 (2011) 
 
Receptor-type tyrosine-protein kinase FLT3
Name:Receptor-type tyrosine-protein kinase FLT3
Type:Enzyme
Mol. Mass.:112888.62
Organism:Homo sapiens (Human)
Description:P36888
Residue:993
BDBM50362083
NameBDBM50362083
Synonyms:CHEMBL1940267
TypeSmall organic molecule
Emp. Form.C24H22N2O5
Mol. Mass.418.4419
SMILESCOc1cccc(COc2ccc(Oc3ncnc4cc(OC)c(OC)cc34)cc2)c1