Reaction Details
TargetReceptor-type tyrosine-protein kinase FLT3
LigandBDBM50362063
Substrate/Competitorn/a
Meas. Tech.ChEMBL_797357 (CHEMBL1942933)
IC50 3±n/a nM
Citation Plé, PAJung, FAshton, SHennequin, LLaine, RMorgentin, RPasquet, GTaylor, S Discovery of AZD2932, a new Quinazoline Ether Inhibitor with high affinity for VEGFR-2 and PDGFR tyrosine kinases. Bioorg Med Chem Lett22:262-6 (2011) 
 
Receptor-type tyrosine-protein kinase FLT3
Name:Receptor-type tyrosine-protein kinase FLT3
Type:Enzyme
Mol. Mass.:112888.62
Organism:Homo sapiens (Human)
Description:P36888
Residue:993
BDBM50362063
NameBDBM50362063
Synonyms:CHEMBL1940107
TypeSmall organic molecule
Emp. Form.C22H23N7O4
Mol. Mass.449.4625
SMILESCOc1cc2ncnc(Oc3cnn(CC(=O)Nc4ccc(cn4)N(C)C)c3)c2cc1OC