Reaction Details
TargetReceptor-type tyrosine-protein kinase FLT3
LigandBDBM50362067
Substrate/Competitorn/a
Meas. Tech.ChEMBL_797357 (CHEMBL1942933)
IC50 10±n/a nM
Citation Plé, PAJung, FAshton, SHennequin, LLaine, RMorgentin, RPasquet, GTaylor, S Discovery of AZD2932, a new Quinazoline Ether Inhibitor with high affinity for VEGFR-2 and PDGFR tyrosine kinases. Bioorg Med Chem Lett22:262-6 (2011) 
 
Receptor-type tyrosine-protein kinase FLT3
Name:Receptor-type tyrosine-protein kinase FLT3
Type:Enzyme
Mol. Mass.:112888.62
Organism:Homo sapiens (Human)
Description:P36888
Residue:993
BDBM50362067
NameBDBM50362067
Synonyms:CHEMBL1940111
TypeSmall organic molecule
Emp. Form.C28H32N6O5
Mol. Mass.532.5909
SMILESCOc1cccc(NC(=O)Cn2cc(Oc3ncnc4cc(OC)c(OCCN5CCCCC5)cc34)cn2)c1