Reaction Details
TargetProstaglandin G/H synthase 1
LigandBDBM50362199
Substrate/Competitorn/a
Meas. Tech.ChEMBL_798165 (CHEMBL1943382)
IC50 54±n/a nM
Citation Brullo, CRocca, MFossa, PCichero, EBarocelli, EBallabeni, VFlammini, LGiorgio, CSaccani, FDomenichini, GBruno, O Synthesis of new 5,6-dihydrobenzo[h]quinazoline 2,4-diamino substituted and antiplatelet/antiphlogistic activities evaluation. Bioorg Med Chem Lett22:1125-9 (2012) 
 
Prostaglandin G/H synthase 1
Name:Prostaglandin G/H synthase 1
Type:Enzyme
Mol. Mass.:68692.62
Organism:Homo sapiens (Human)
Description:P23219
Residue:599
BDBM50362199
NameBDBM50362199
Synonyms:CHEMBL1938840
TypeSmall organic molecule
Emp. Form.C15H18N4O2
Mol. Mass.286.329
SMILESCC(C)(C)OC1Oc2ccccc2-c2nc(NN)ncc12