Reaction Details
TargetB1 bradykinin receptor
LigandBDBM50362314
Substrate/Competitorn/a
Meas. Tech.ChEMBL_797692 (CHEMBL1943912)
IC50 1.53±n/a nM
Citation Qian, WChen, JJHuman, JAya, TZhu, JBiswas, KPeterkin, THungate, RWArik, LJohnson, EKumar, GJoseph, SJona, JGuo, HXWu, Z Discovery of dehydro-oxopiperazine acetamides as novel bradykinin B1 receptor antagonists with enhanced in vitro potency. Bioorg Med Chem Lett22:1061-7 (2012) 
 
B1 bradykinin receptor
Name:B1 bradykinin receptor
Type:Enzyme
Mol. Mass.:40508.87
Organism:Homo sapiens (Human)
Description:P46663
Residue:353
BDBM50362314
NameBDBM50362314
Synonyms:CHEMBL1939953
TypeSmall organic molecule
Emp. Form.C22H29ClN4O4S
Mol. Mass.481.008
SMILESCN1CCC2(CCN(C2)C(=O)C[C@H]2N(C=CNC2=O)S(=O)(=O)c2cc(C)c(Cl)cc2C)C1