Reaction Details
TargetB1 bradykinin receptor
LigandBDBM50272456
Substrate/Competitorn/a
Meas. Tech.ChEMBL_797691 (CHEMBL1943911)
Ki 0.24±n/a nM
Citation Qian, WChen, JJHuman, JAya, TZhu, JBiswas, KPeterkin, THungate, RWArik, LJohnson, EKumar, GJoseph, SJona, JGuo, HXWu, Z Discovery of dehydro-oxopiperazine acetamides as novel bradykinin B1 receptor antagonists with enhanced in vitro potency. Bioorg Med Chem Lett22:1061-7 (2012) 
 
B1 bradykinin receptor
Name:B1 bradykinin receptor
Type:Enzyme
Mol. Mass.:40508.87
Organism:Homo sapiens (Human)
Description:P46663
Residue:353
BDBM50272456
NameBDBM50272456
Synonyms:2-((R)-3-oxo-1-tosyl-1,2,3,4-tetrahydroquinoxalin-2-yl)-N-((R)-7-(piperidin-1-ylmethyl)chroman-4-yl)acetamide | CHEMBL447870
TypeSmall organic molecule
Emp. Form.C32H36N4O5S
Mol. Mass.588.717
SMILESCc1ccc(cc1)S(=O)(=O)N1[C@H](CC(=O)N[C@@H]2CCOc3cc(CN4CCCCC4)ccc23)C(=O)Nc2ccccc12