Reaction Details
TargetKappa-type opioid receptor
LigandBDBM50362540
Substrate/Competitorn/a
Meas. Tech.ChEMBL_797873 (CHEMBL1942560)
Ki 2.5±n/a nM
Citation Béguin, CPotuzak, JXu, WLiu-Chen, LYStreicher, JMGroer, CEBohn, LMCarlezon, WACohen, BM Differential signaling properties at the kappa opioid receptor of 12-epi-salvinorin A and its analogues. Bioorg Med Chem Lett22:1023-6 (2012) 
 
Kappa-type opioid receptor
Name:Kappa-type opioid receptor
Type:G Protein-Coupled Receptor (GPCR)
Mol. Mass.:42648.76
Organism:Homo sapiens (Human)
Description:P41145
Residue:380
BDBM50362540
NameBDBM50362540
Synonyms:CHEMBL1941031
TypeSmall organic molecule
Emp. Form.C24H32O8
Mol. Mass.448.5061
SMILESCCOCO[C@H]1C[C@@H](C(=O)OC)[C@]2(C)CC[C@H]3C(=O)O[C@H](C[C@]3(C)[C@H]2C1=O)c1ccoc1