Reaction Details
TargetKappa-type opioid receptor
LigandBDBM50362541
Substrate/Competitorn/a
Meas. Tech.ChEMBL_797873 (CHEMBL1942560)
Ki 63±n/a nM
Citation Béguin, CPotuzak, JXu, WLiu-Chen, LYStreicher, JMGroer, CEBohn, LMCarlezon, WACohen, BM Differential signaling properties at the kappa opioid receptor of 12-epi-salvinorin A and its analogues. Bioorg Med Chem Lett22:1023-6 (2012) 
 
Kappa-type opioid receptor
Name:Kappa-type opioid receptor
Type:G Protein-Coupled Receptor (GPCR)
Mol. Mass.:42648.76
Organism:Homo sapiens (Human)
Description:P41145
Residue:380
BDBM50362541
NameBDBM50362541
Synonyms:CHEMBL1941032
TypeSmall organic molecule
Emp. Form.C21H26O7
Mol. Mass.390.4269
SMILESCOC(=O)[C@@H]1C[C@H](O)C(=O)[C@H]2[C@@]1(C)CC[C@H]1C(=O)O[C@H](C[C@]21C)c1ccoc1