Reaction Details
TargetNeuronal acetylcholine receptor subunit alpha-7
LigandBDBM50135594
Substrate/Competitorn/a
Meas. Tech.ChEMBL_797630 (CHEMBL1943748)
Ki 12±n/a nM
Citation Dallanoce, CMatera, CPucci, LGotti, CClementi, FAmici, MDMicheli, CD Synthesis and binding affinity ata4ß2 anda7 nicotinic acetylcholine receptors of new analogs of epibatidine and epiboxidine containing the 7-azabicyclo[2.2.1]hept-2-ene ring system. Bioorg Med Chem Lett22:829-32 (2012) 
 
Neuronal acetylcholine receptor subunit alpha-7
Name:Neuronal acetylcholine receptor subunit alpha-7
Type:n/a
Mol. Mass.:56448.33
Organism:Homo sapiens (Human)
Description: CHRNA7 (NACHRA7)
Residue:502
BDBM50135594
NameBDBM50135594
Synonyms:(+/-)-2-(6-chloropyridin-3-yl)-9-aza-bicyclo[4.2.1]non-2-ene CHEMBL63102 | UB-165
TypeSmall organic molecule
Emp. Form.C13H15ClN2
Mol. Mass.234.725
SMILESClc1ccc(cn1)C1=CCCC2CCC1N2