Reaction Details
TargetAldo-keto reductase family 1 member B1
LigandBDBM50241243
Substrate/Competitorn/a
Meas. Tech.ChEMBL_797273 (CHEMBL1942674)
IC50 60500±n/a nM
Citation Naeem, SHylands, PBarlow, D Construction of an Indonesian herbal constituents database and its use in Random Forest modelling in a search for inhibitors of aldose reductase. Bioorg Med Chem20:1251-8 (2012) 
 
Aldo-keto reductase family 1 member B1
Name:Aldo-keto reductase family 1 member B1
Type:Protein
Mol. Mass.:35855.50
Organism:Homo sapiens (Human)
Description:P15121. 4LAU; 2IKI; 4LB4; 2FZD; 2FZ8; 1US0
Residue:316
BDBM50241243
NameBDBM50241243
Synonyms:3,4',5,7-Tetrahydroxyflavone-3-glucoside 4H-1-Benzopyran-4-one, 3-(beta-D-glucopyranosyloxy)-5,7-dihydroxy-2-(4-hydroxyphenyl)- Astragalin cid_5282102 | kaempferol 3-O-glucoside
TypeSmall organic molecule
Emp. Form.C21H20O11
Mol. Mass.448.3769
SMILESOC[C@H]1O[C@@H](Oc2c(O)c3c(cc(O)cc3=O)oc2-c2ccc(O)cc2)[C@H](O)[C@@H](O)[C@@H]1O