Reaction Details
TargetAldo-keto reductase family 1 member B1
LigandBDBM50362886
Substrate/Competitorn/a
Meas. Tech.ChEMBL_797273 (CHEMBL1942674)
IC50 566660±n/a nM
Citation Naeem, SHylands, PBarlow, D Construction of an Indonesian herbal constituents database and its use in Random Forest modelling in a search for inhibitors of aldose reductase. Bioorg Med Chem20:1251-8 (2012) 
 
Aldo-keto reductase family 1 member B1
Name:Aldo-keto reductase family 1 member B1
Type:Protein
Mol. Mass.:35855.50
Organism:Homo sapiens (Human)
Description:P15121. 4LAU; 2IKI; 4LB4; 2FZD; 2FZ8; 1US0
Residue:316
BDBM50362886
NameBDBM50362886
Synonyms:VITEXIN
TypeSmall organic molecule
Emp. Form.C21H20O10
Mol. Mass.432.3775
SMILESOC[C@H]1O[C@H]([C@H](O)[C@@H](O)[C@@H]1O)c1c(O)cc(O)c2c1oc(cc2=O)-c1ccc(O)cc1