Reaction Details
TargetAldo-keto reductase family 1 member B1
LigandBDBM50327036
Substrate/Competitorn/a
Meas. Tech.ChEMBL_797273 (CHEMBL1942674)
IC50 1800±n/a nM
Citation Naeem, SHylands, PBarlow, D Construction of an Indonesian herbal constituents database and its use in Random Forest modelling in a search for inhibitors of aldose reductase. Bioorg Med Chem20:1251-8 (2012) 
 
Aldo-keto reductase family 1 member B1
Name:Aldo-keto reductase family 1 member B1
Type:Protein
Mol. Mass.:35855.50
Organism:Homo sapiens (Human)
Description:P15121. 4LAU; 2IKI; 4LB4; 2FZD; 2FZ8; 1US0
Residue:316
BDBM50327036
NameBDBM50327036
Synonyms:(1R,3S,4S,5S)-3-[(E)-3-(3,4-Dihydroxy-phenyl)-acryloyloxy]-1,4,5-trihydroxy-cyclohexanecarboxylic acid (1S,3R,4R,5R,E)-3-(3-(3,4-dihydroxyphenyl)acryloyloxy)-1,4,5-trihydroxycyclohexanecarboxylic acid 3-[3-(3,4-Dihydroxy-phenyl)-acryloyloxy]-1,4,5-trihydroxy-cyclohexanecarboxylic acid 5-caffeoyl quinic acid Caffeoylquinic acid Chlorogenicacid US11866416, Example 10 | chlorogenic acid
TypeSmall organic molecule
Emp. Form.C16H18O9
Mol. Mass.354.3087
SMILESO[C@@H]1C[C@](O)(C[C@@H](OC(=O)\C=C\c2ccc(O)c(O)c2)[C@@H]1O)C(O)=O