Reaction Details
TargetProtein-S-isoprenylcysteine O-methyltransferase
LigandBDBM50363183
Substrate/Competitorn/a
Meas. Tech.ChEMBL_800448 (CHEMBL1948469)
IC50 63000±n/a nM
Citation Majmudar, JDHodges-Loaiza, HBHahne, KDonelson, JLSong, JShrestha, LHarrison, MLHrycyna, CAGibbs, RA Amide-modified prenylcysteine based Icmt inhibitors: Structure-activity relationships, kinetic analysis and cellular characterization. Bioorg Med Chem20:283-95 (2011) 
 
Protein-S-isoprenylcysteine O-methyltransferase
Name:Protein-S-isoprenylcysteine O-methyltransferase
Type:PROTEIN
Mol. Mass.:31943.26
Organism:Homo sapiens (Human)
Description:ChEMBL_956034
Residue:284
BDBM50363183
NameBDBM50363183
Synonyms:CHEMBL1946585
TypeSmall organic molecule
Emp. Form.C31H39NO4S
Mol. Mass.521.711
SMILES[#6]\[#6](-[#6])=[#6]\[#6]-[#6]\[#6](-[#6])=[#6]\[#6]-[#6]\[#6](-[#6])=[#6]\[#6]-[#16]-[#6]-[#6@H](-[#7]-[#6](=O)-c1ccc(-[#8]-c2ccccc2)cc1)-[#6](-[#8])=O