Reaction Details
TargetProtein-S-isoprenylcysteine O-methyltransferase
LigandBDBM50363189
Substrate/Competitorn/a
Meas. Tech.ChEMBL_800448 (CHEMBL1948469)
IC50 13400±n/a nM
Citation Majmudar, JDHodges-Loaiza, HBHahne, KDonelson, JLSong, JShrestha, LHarrison, MLHrycyna, CAGibbs, RA Amide-modified prenylcysteine based Icmt inhibitors: Structure-activity relationships, kinetic analysis and cellular characterization. Bioorg Med Chem20:283-95 (2011) 
 
Protein-S-isoprenylcysteine O-methyltransferase
Name:Protein-S-isoprenylcysteine O-methyltransferase
Type:PROTEIN
Mol. Mass.:31943.26
Organism:Homo sapiens (Human)
Description:ChEMBL_956034
Residue:284
BDBM50363189
NameBDBM50363189
Synonyms:CHEMBL1946591
TypeSmall organic molecule
Emp. Form.C32H41NO4S
Mol. Mass.535.737
SMILES[#6]\[#6](-[#6])=[#6]\[#6]-[#6]\[#6](-[#6])=[#6]\[#6]-[#6]\[#6](-[#6])=[#6]\[#6]-[#16]-[#6]-[#6@H](-[#7]-[#6](=O)-c1ccccc1-[#8]-[#6]-c1ccccc1)-[#6](-[#8])=O