Reaction Details
Target5-hydroxytryptamine receptor 3A
LigandBDBM50363284
Substrate/Competitorn/a
Meas. Tech.ChEMBL_800919 (CHEMBL1948646)
Ki 199±n/a nM
Citation Simonin, JVernekar, SKThompson, AJHothersall, JDConnolly, CNLummis, SCLochner, M High-affinity fluorescent ligands for the 5-HT(3) receptor. Bioorg Med Chem Lett22:1151-5 (2012) 
 
5-hydroxytryptamine receptor 3A
Name:5-hydroxytryptamine receptor 3A
Type:Protein
Mol. Mass.:55283.27
Organism:Homo sapiens (Human)
Description:P46098
Residue:478
BDBM50363284
NameBDBM50363284
Synonyms:CHEMBL1945712
TypeSmall organic molecule
Emp. Form.C34H42N6O4
Mol. Mass.598.7351
SMILESCCN(CC)c1ccc2cc(C(=O)NCCCn3nc(C(=O)NC4C[C@@H]5CCC[C@@H](C4)N5C)c4ccccc34)c(=O)oc2c1