Reaction Details
Target5-hydroxytryptamine receptor 3A
LigandBDBM50363285
Substrate/Competitorn/a
Meas. Tech.ChEMBL_800919 (CHEMBL1948646)
Ki 1.6±n/a nM
Citation Simonin, JVernekar, SKThompson, AJHothersall, JDConnolly, CNLummis, SCLochner, M High-affinity fluorescent ligands for the 5-HT(3) receptor. Bioorg Med Chem Lett22:1151-5 (2012) 
 
5-hydroxytryptamine receptor 3A
Name:5-hydroxytryptamine receptor 3A
Type:Protein
Mol. Mass.:55283.27
Organism:Homo sapiens (Human)
Description:P46098
Residue:478
BDBM50363285
NameBDBM50363285
Synonyms:CHEMBL1945713
TypeSmall organic molecule
Emp. Form.C41H40N6O6S
Mol. Mass.744.858
SMILESCN1[C@H]2CCC[C@H]1CC(C2)NC(=O)c1nn(CCCNC(=S)Nc2ccc(c(c2)C(O)=O)-c2c3ccc(O)cc3oc3cc(=O)ccc23)c2ccccc12