Reaction Details
TargetHistamine H3 receptor
LigandBDBM50363320
Substrate/Competitorn/a
Meas. Tech.ChEMBL_801099 (CHEMBL1948884)
Ki 2±n/a nM
Citation Tao, MAimone, LDGruner, JAMathiasen, JRHuang, ZLyons, JRaddatz, RHudkins, RL Synthesis and structure-activity relationship of 5-pyridazin-3-one phenoxypiperidines as potent, selective histamine H(3) receptor inverse agonists. Bioorg Med Chem Lett22:1073-7 (2012) 
 
Histamine H3 receptor
Name:Histamine H3 receptor
Type:G Protein-Coupled Receptor (GPCR)
Mol. Mass.:48691.47
Organism:Homo sapiens (Human)
Description:Binding assays were using CHO cells stably expressing hH3R receptors.
Residue:445
BDBM50363320
NameBDBM50363320
Synonyms:CHEMBL1945844
TypeSmall organic molecule
Emp. Form.C19H23N3O2
Mol. Mass.325.4048
SMILESO=c1cc(cn[nH]1)-c1ccc(OC2CCN(CC2)C2CCC2)cc1