Reaction Details
TargetPotassium voltage-gated channel subfamily H member 2
LigandBDBM50363339
Substrate/Competitorn/a
Meas. Tech.ChEMBL_801328 (CHEMBL1947877)
IC50 900±n/a nM
Citation Dantzman, CLKing, MMErnst, GEWang, XMcCauley, JPAndisik, DWBrush, KBui, KHFrietze, WHoesch, VLiu, JPalmer, WESpear, NHudzik, TJWesolowski, SS 4-Piperidin-4-ylidenemethyl-benzamides asd-opioid receptor agonists for CNS indications: identifying clinical candidates. Bioorg Med Chem Lett22:1174-8 (2012) 
 
Potassium voltage-gated channel subfamily H member 2
Name:Potassium voltage-gated channel subfamily H member 2
Type:Multi-pass membrane protein
Mol. Mass.:126672.65
Organism:Homo sapiens (Human)
Description:Q12809
Residue:1159
BDBM50363339
NameBDBM50363339
Synonyms:CHEMBL1946024
TypeSmall organic molecule
Emp. Form.C32H36FN3O3
Mol. Mass.529.6449
SMILES[#6]-[#6]-[#7](-[#6]-[#6])-[#6](=O)-c1ccc(cc1)-[#6](=[#6]-1/[#6]-[#6]-[#7](-[#6]-c2ccc(F)cc2)-[#6]-[#6]-1)\c1ccc(-[#7]-[#6](=O)-[#8]-[#6])cc1