Reaction Details
TargetCarbonic anhydrase 1
LigandBDBM12414
Substrate/Competitorn/a
Meas. Tech.ChEMBL_801485 (CHEMBL1948412)
Ki 12360±n/a nM
Citation Balaydin, HTSentürk, MMenzek, A Synthesis and carbonic anhydrase inhibitory properties of novel cyclohexanonyl bromophenol derivatives. Bioorg Med Chem Lett22:1352-7 (2012) 
 
Carbonic anhydrase 1
Name:Carbonic anhydrase 1
Type:Enzyme
Mol. Mass.:28873.37
Organism:Homo sapiens (Human)
Description:P00915
Residue:261
BDBM12414
NameBDBM12414
Synonyms:CHEMBL27601 hCA inhibitor, 6
TypeSmall organic molecule
Emp. Form.C6H7NO2S
Mol. Mass.157.19
SMILESNS(=O)(=O)c1ccccc1