Reaction Details
TargetNitric oxide synthase, endothelial
LigandBDBM50363618
Substrate/Competitorn/a
Meas. Tech.ChEMBL_801785 (CHEMBL1947348)
Ki 75000±n/a nM
Citation Salerno, LModica, MNRomeo, GPittalà, VSiracusa, MAAmato, MEAcquaviva, RDi Giacomo, CSorrenti, V Novel inhibitors of nitric oxide synthase with antioxidant properties. Eur J Med Chem49:118-26 (2012) 
 
Nitric oxide synthase, endothelial
Name:Nitric oxide synthase, endothelial
Type:PROTEIN
Mol. Mass.:132922.33
Organism:Mus musculus
Description:ChEMBL_801785
Residue:1202
BDBM50363618
NameBDBM50363618
Synonyms:CHEMBL1946358
TypeSmall organic molecule
Emp. Form.C15H10N4O5
Mol. Mass.326.2637
SMILES[O-][N+](=O)c1ccc(cc1)C(=O)Cn1cc2cccc([N+]([O-])=O)c2n1