Reaction Details
TargetNitric oxide synthase, endothelial
LigandBDBM50363624
Substrate/Competitorn/a
Meas. Tech.ChEMBL_801785 (CHEMBL1947348)
Ki 37500±n/a nM
Citation Salerno, LModica, MNRomeo, GPittalà, VSiracusa, MAAmato, MEAcquaviva, RDi Giacomo, CSorrenti, V Novel inhibitors of nitric oxide synthase with antioxidant properties. Eur J Med Chem49:118-26 (2012) 
 
Nitric oxide synthase, endothelial
Name:Nitric oxide synthase, endothelial
Type:PROTEIN
Mol. Mass.:132922.33
Organism:Mus musculus
Description:ChEMBL_801785
Residue:1202
BDBM50363624
NameBDBM50363624
Synonyms:CHEMBL1946353
TypeSmall organic molecule
Emp. Form.C17H15N3O3
Mol. Mass.309.3193
SMILESCc1cc2ncn(CC(=O)c3ccc(cc3)[N+]([O-])=O)c2cc1C