Reaction Details
TargetNitric oxide synthase, endothelial
LigandBDBM50363627
Substrate/Competitorn/a
Meas. Tech.ChEMBL_801785 (CHEMBL1947348)
Ki 90000±n/a nM
Citation Salerno, LModica, MNRomeo, GPittalà, VSiracusa, MAAmato, MEAcquaviva, RDi Giacomo, CSorrenti, V Novel inhibitors of nitric oxide synthase with antioxidant properties. Eur J Med Chem49:118-26 (2012) 
 
Nitric oxide synthase, endothelial
Name:Nitric oxide synthase, endothelial
Type:PROTEIN
Mol. Mass.:132922.33
Organism:Mus musculus
Description:ChEMBL_801785
Residue:1202
BDBM50363627
NameBDBM50363627
Synonyms:CHEMBL1946208
TypeSmall organic molecule
Emp. Form.C13H13N3O3
Mol. Mass.259.2606
SMILESCc1cc(C)n(CC(=O)c2ccc(cc2)[N+]([O-])=O)n1