Reaction Details
TargetNitric oxide synthase, endothelial
LigandBDBM50363635
Substrate/Competitorn/a
Meas. Tech.ChEMBL_801785 (CHEMBL1947348)
Ki 45000±n/a nM
Citation Salerno, LModica, MNRomeo, GPittalà, VSiracusa, MAAmato, MEAcquaviva, RDi Giacomo, CSorrenti, V Novel inhibitors of nitric oxide synthase with antioxidant properties. Eur J Med Chem49:118-26 (2012) 
 
Nitric oxide synthase, endothelial
Name:Nitric oxide synthase, endothelial
Type:PROTEIN
Mol. Mass.:132922.33
Organism:Mus musculus
Description:ChEMBL_801785
Residue:1202
BDBM50363635
NameBDBM50363635
Synonyms:CHEMBL1945914
TypeSmall organic molecule
Emp. Form.C14H15N3O3
Mol. Mass.273.2872
SMILESCCCc1nccn1CC(=O)c1ccc(cc1)[N+]([O-])=O