Reaction Details
TargetNitric oxide synthase, brain
LigandBDBM50240895
Substrate/Competitorn/a
Meas. Tech.ChEMBL_801784 (CHEMBL1947347)
Ki 105000±n/a nM
Citation Salerno, LModica, MNRomeo, GPittalà, VSiracusa, MAAmato, MEAcquaviva, RDi Giacomo, CSorrenti, V Novel inhibitors of nitric oxide synthase with antioxidant properties. Eur J Med Chem49:118-26 (2012) 
 
Nitric oxide synthase, brain
Name:Nitric oxide synthase, brain
Type:Enzyme
Mol. Mass.:160570.98
Organism:Rattus norvegicus (rat)
Description:Recombinant nNOS overexpressed in E. coli was used in enzyme assays.
Residue:1429
BDBM50240895
NameBDBM50240895
Synonyms:2-(1H-Imidazol-1-yl)-1-(4-nitrophenyl)ethanone CHEMBL162549
TypeSmall organic molecule
Emp. Form.C11H9N3O3
Mol. Mass.231.2075
SMILES[O-][N+](=O)c1ccc(cc1)C(=O)Cn1ccnc1