Reaction Details
TargetNitric oxide synthase, brain
LigandBDBM50363623
Substrate/Competitorn/a
Meas. Tech.ChEMBL_801784 (CHEMBL1947347)
Ki 31660±n/a nM
Citation Salerno, LModica, MNRomeo, GPittalà, VSiracusa, MAAmato, MEAcquaviva, RDi Giacomo, CSorrenti, V Novel inhibitors of nitric oxide synthase with antioxidant properties. Eur J Med Chem49:118-26 (2012) 
 
Nitric oxide synthase, brain
Name:Nitric oxide synthase, brain
Type:Enzyme
Mol. Mass.:160570.98
Organism:Rattus norvegicus (rat)
Description:Recombinant nNOS overexpressed in E. coli was used in enzyme assays.
Residue:1429
BDBM50363623
NameBDBM50363623
Synonyms:CHEMBL1946354
TypeSmall organic molecule
Emp. Form.C14H10N4O3
Mol. Mass.282.2542
SMILES[O-][N+](=O)c1ccc(cc1)C(=O)Cn1cnc2cccnc12