Reaction Details
TargetNitric oxide synthase, brain
LigandBDBM50363627
Substrate/Competitorn/a
Meas. Tech.ChEMBL_801784 (CHEMBL1947347)
Ki 65000±n/a nM
Citation Salerno, LModica, MNRomeo, GPittalà, VSiracusa, MAAmato, MEAcquaviva, RDi Giacomo, CSorrenti, V Novel inhibitors of nitric oxide synthase with antioxidant properties. Eur J Med Chem49:118-26 (2012) 
 
Nitric oxide synthase, brain
Name:Nitric oxide synthase, brain
Type:Enzyme
Mol. Mass.:160570.98
Organism:Rattus norvegicus (rat)
Description:Recombinant nNOS overexpressed in E. coli was used in enzyme assays.
Residue:1429
BDBM50363627
NameBDBM50363627
Synonyms:CHEMBL1946208
TypeSmall organic molecule
Emp. Form.C13H13N3O3
Mol. Mass.259.2606
SMILESCc1cc(C)n(CC(=O)c2ccc(cc2)[N+]([O-])=O)n1