Reaction Details
TargetNitric oxide synthase, brain
LigandBDBM50363628
Substrate/Competitorn/a
Meas. Tech.ChEMBL_801784 (CHEMBL1947347)
Ki 63000±n/a nM
Citation Salerno, LModica, MNRomeo, GPittalà, VSiracusa, MAAmato, MEAcquaviva, RDi Giacomo, CSorrenti, V Novel inhibitors of nitric oxide synthase with antioxidant properties. Eur J Med Chem49:118-26 (2012) 
 
Nitric oxide synthase, brain
Name:Nitric oxide synthase, brain
Type:Enzyme
Mol. Mass.:160570.98
Organism:Rattus norvegicus (rat)
Description:Recombinant nNOS overexpressed in E. coli was used in enzyme assays.
Residue:1429
BDBM50363628
NameBDBM50363628
Synonyms:CHEMBL1946207
TypeSmall organic molecule
Emp. Form.C12H11N3O3
Mol. Mass.245.234
SMILESCc1ccnn1CC(=O)c1ccc(cc1)[N+]([O-])=O