Reaction Details
TargetNitric oxide synthase, brain
LigandBDBM50363640
Substrate/Competitorn/a
Meas. Tech.ChEMBL_801784 (CHEMBL1947347)
Ki 450000±n/a nM
Citation Salerno, LModica, MNRomeo, GPittalà, VSiracusa, MAAmato, MEAcquaviva, RDi Giacomo, CSorrenti, V Novel inhibitors of nitric oxide synthase with antioxidant properties. Eur J Med Chem49:118-26 (2012) 
 
Nitric oxide synthase, brain
Name:Nitric oxide synthase, brain
Type:Enzyme
Mol. Mass.:160570.98
Organism:Rattus norvegicus (rat)
Description:Recombinant nNOS overexpressed in E. coli was used in enzyme assays.
Residue:1429
BDBM50363640
NameBDBM50363640
Synonyms:CHEMBL1945755
TypeSmall organic molecule
Emp. Form.C14H15BrN2O
Mol. Mass.307.186
SMILESCC(C)c1nccn1CC(=O)c1ccc(Br)cc1