Reaction Details
TargetCarbonic anhydrase 1
LigandBDBM10874
Substrate/Competitorn/a
Meas. Tech.ChEMBL_801828 (CHEMBL1947440)
Ki 95±n/a nM
Citation Ohradanova, AVullo, DPastorekova, SPastorek, JJackson, DJWörheide, GSupuran, CT Cloning, characterization and sulfonamide inhibition studies of ana-carbonic anhydrase from the living fossil sponge Astrosclera willeyana. Bioorg Med Chem20:1403-10 (2012) 
 
Carbonic anhydrase 1
Name:Carbonic anhydrase 1
Type:Enzyme
Mol. Mass.:28873.37
Organism:Homo sapiens (Human)
Description:P00915
Residue:261
BDBM10874
NameBDBM10874
Synonyms:6-hydroxy-1,3-benzothiazole-2-sulfonamide aromatic/heteroaromatic sulfonamide 19
TypeSmall organic molecule
Emp. Form.C7H6N2O3S2
Mol. Mass.230.264
SMILESNS(=O)(=O)c1nc2ccc(O)cc2s1