Reaction Details
TargetCarbonic anhydrase 2
LigandBDBM10855
Substrate/Competitorn/a
Meas. Tech.ChEMBL_801829 (CHEMBL1947441)
Ki 295±n/a nM
Citation Ohradanova, AVullo, DPastorekova, SPastorek, JJackson, DJWörheide, GSupuran, CT Cloning, characterization and sulfonamide inhibition studies of ana-carbonic anhydrase from the living fossil sponge Astrosclera willeyana. Bioorg Med Chem20:1403-10 (2012) 
 
Carbonic anhydrase 2
Name:Carbonic anhydrase 2
Type:Enzyme
Mol. Mass.:29250.71
Organism:Homo sapiens (Human)
Description:P00918
Residue:260
BDBM10855
NameBDBM10855
Synonyms:2-aminobenzene-1-sulfonamide US10172837, 2-aminobenzenesulfonamide orthanilamide 17
TypeSmall organic molecule
Emp. Form.C6H8N2O2S
Mol. Mass.172.205
SMILESNc1ccccc1S(N)(=O)=O