Reaction Details
TargetCarbonic anhydrase
LigandBDBM10859
Substrate/Competitorn/a
Meas. Tech.ChEMBL_801827 (CHEMBL1947439)
Ki 675±n/a nM
Citation Ohradanova, AVullo, DPastorekova, SPastorek, JJackson, DJWörheide, GSupuran, CT Cloning, characterization and sulfonamide inhibition studies of ana-carbonic anhydrase from the living fossil sponge Astrosclera willeyana. Bioorg Med Chem20:1403-10 (2012) 
 
Carbonic anhydrase
Name:Carbonic anhydrase
Synonyms:Astrosclerin-3
Type:PROTEIN
Mol. Mass.:33233.07
Organism:Astrosclera willeyana
Description:ChEMBL_801827
Residue:292
BDBM10859
NameBDBM10859
TypeSmall organic molecule
Emp. Form.C7H9NO2S
Mol. Mass.171.217
SMILESCc1ccc(cc1)S(N)(=O)=O