Reaction Details
TargetSodium-dependent dopamine transporter
LigandBDBM50363762
Substrate/Competitorn/a
Meas. Tech.ChEMBL_801859 (CHEMBL1947471)
Ki 0.87±n/a nM
Citation Mavel, SMincheva, ZMéheux, NCarcenac, YGuilloteau, DAbarbri, MEmond, P QSAR study and synthesis of new phenyltropanes as ligands of the dopamine transporter (DAT). Bioorg Med Chem20:1388-95 (2012) 
 
Sodium-dependent dopamine transporter
Name:Sodium-dependent dopamine transporter
Type:Multi-pass membrane protein
Mol. Mass.:68497.11
Organism:Homo sapiens (Human)
Description:Q01959
Residue:620
BDBM50363762
NameBDBM50363762
Synonyms:CHEMBL1947088
TypeSmall organic molecule
Emp. Form.C20H23F3INO2
Mol. Mass.493.3018
SMILESCOC(=O)[C@@H]1[C@H]2CC[C@@H](C[C@@H]1c1ccc(C)cc1)N2C\C(I)=C\C(F)(F)F