Reaction Details
TargetTransient receptor potential cation channel subfamily A member 1
LigandBDBM50363892
Substrate/Competitorn/a
Meas. Tech.ChEMBL_802299 (CHEMBL1949457)
IC50 2600±n/a nM
Citation Baraldi, PGRomagnoli, RSaponaro, GAghazadeh Tabrizi, MBaraldi, SPedretti, PFusi, CNassini, RMaterazzi, SGeppetti, PPreti, D 7-Substituted-pyrrolo[3,2-d]pyrimidine-2,4-dione derivatives as antagonists of the transient receptor potential ankyrin 1 (TRPA1) channel: a promising approach for treating pain and inflammation. Bioorg Med Chem20:1690-8 (2012) 
 
Transient receptor potential cation channel subfamily A member 1
Name:Transient receptor potential cation channel subfamily A member 1
Type:Protein
Mol. Mass.:127514.20
Organism:Homo sapiens (Human)
Description:O75762
Residue:1119
BDBM50363892
NameBDBM50363892
Synonyms:CHEMBL1946121
TypeSmall organic molecule
Emp. Form.C25H29N5O3S
Mol. Mass.479.594
SMILESCCCCCCc1ccc(cc1)-c1csc(NC(=O)Cn2ccc3n(C)c(=O)n(C)c(=O)c23)n1