Reaction Details
TargetTransient receptor potential cation channel subfamily A member 1
LigandBDBM50362753
Substrate/Competitorn/a
Meas. Tech.ChEMBL_802303 (CHEMBL1949461)
IC50 3800±n/a nM
Citation Baraldi, PGRomagnoli, RSaponaro, GAghazadeh Tabrizi, MBaraldi, SPedretti, PFusi, CNassini, RMaterazzi, SGeppetti, PPreti, D 7-Substituted-pyrrolo[3,2-d]pyrimidine-2,4-dione derivatives as antagonists of the transient receptor potential ankyrin 1 (TRPA1) channel: a promising approach for treating pain and inflammation. Bioorg Med Chem20:1690-8 (2012) 
 
Transient receptor potential cation channel subfamily A member 1
Name:Transient receptor potential cation channel subfamily A member 1
Type:PROTEIN
Mol. Mass.:128622.74
Organism:Rattus norvegicus
Description:ChEMBL_1450487
Residue:1125
BDBM50362753
NameBDBM50362753
Synonyms:CHEMBL1939978
TypeSmall organic molecule
Emp. Form.C18H14N2O2S
Mol. Mass.322.381
SMILESCOc1cccc(c1)C1NC(=S)N=C2C1C(=O)c1ccccc21