Reaction Details
TargetC-C chemokine receptor type 2
LigandBDBM50363953
Substrate/Competitorn/a
Meas. Tech.ChEMBL_802789 (CHEMBL1953523)
IC50 4.7±n/a nM
Citation Xue, CBFeng, HCao, GHuang, TGlenn, JAnand, RMeloni, DZhang, KKong, LWang, AZhang, YZheng, CXia, MChen, LTanaka, HHan, QRobinson, DJModi, DStorace, LShao, LSharief, VLi, MGalya, LGCovington, MScherle, PDiamond, SEmm, TYeleswaram, SContel, NVaddi, KNewton, RHollis, GFriedman, SMetcalf, B Discovery of INCB3284, a Potent, Selective, and Orally Bioavailable hCCR2 Antagonist. ACS Med Chem Lett2:450-454 (2011) 
 
C-C chemokine receptor type 2
Name:C-C chemokine receptor type 2
Type:Enzyme
Mol. Mass.:41932.32
Organism:Homo sapiens (Human)
Description:P41597
Residue:374
BDBM50363953
NameBDBM50363953
Synonyms:CHEMBL1951778 | CHEMBL1963131
TypeSmall organic molecule
Emp. Form.C26H31F3N4O4
Mol. Mass.520.5439
SMILESCOc1ccc(cn1)[C@]1(O)CC[C@@H](CC1)N1CC[C@H](C1)NC(=O)CNC(=O)c1cccc(c1)C(F)(F)F