Reaction Details
TargetAurora kinase A
LigandBDBM50363997
Substrate/Competitorn/a
Meas. Tech.ChEMBL_804136 (CHEMBL1952701)
IC50 234000±n/a nM
Citation Shomin, CDRestituyo, ECox, KJGhosh, I Selection of cyclic-peptide inhibitors targeting Aurora kinase A: problems and solutions. Bioorg Med Chem19:6743-9 (2011) 
 
Aurora kinase A
Name:Aurora kinase A
Type:Serine/threonine-protein kinase
Mol. Mass.:45830.98
Organism:Homo sapiens (Human)
Description:O14965
Residue:403
BDBM50363997
NameBDBM50363997
Synonyms:CHEMBL1950042
TypeSmall organic molecule
Emp. Form.C36H55N13O10S2
Mol. Mass.894.033
SMILESCC(C)[C@@H]1NC(=O)[C@H](CCC(N)=O)NC(=O)[C@@H]2CCCN2C(=O)[C@H](Cc2cnc[nH]2)NC(=O)CNC(=O)[C@@H](N)CSSC[C@H](NC(=O)[C@@H]2CCCN2C1=O)C(=O)NCC(N)=O