Reaction Details
TargetEstrogen receptor
LigandBDBM17292
Substrate/Competitorn/a
Meas. Tech.ChEMBL_802376 (CHEMBL1954683)
EC50 0.123±n/a nM
Citation Carroll, VMJeyakumar, MCarlson, KEKatzenellenbogen, JA Diarylpropionitrile (DPN) enantiomers: synthesis and evaluation of estrogen receptorß-selective ligands. J Med Chem55:528-37 (2012) 
 
Estrogen receptor
Name:Estrogen receptor
Type:Protein
Mol. Mass.:66230.44
Organism:Homo sapiens (Human)
Description:P03372
Residue:595
BDBM17292
NameBDBM17292
Synonyms:(1S,10R,11S,14S,15S)-15-methyltetracyclo[8.7.0.0^{2,7}.0^{11,15}]heptadeca-2,4,6-triene-5,14-diol 17α-ethinylestradiol CHEMBL135 ESTRADIOL Ovocyclin US9040509, E2 US9561238, E2 [2,4,6,7-3H]-E2 [3H]]estradiol
TypeSteroid
Emp. Form.C18H24O2
Mol. Mass.272.382
SMILES[H][C@@]12CC[C@H](O)[C@@]1(C)CC[C@]1([H])c3ccc(O)cc3CC[C@@]21[H]