Reaction Details
TargetEstrogen receptor
LigandBDBM50364076
Substrate/Competitorn/a
Meas. Tech.ChEMBL_802366 (CHEMBL1954673)
EC50 2.9±n/a nM
Citation Carroll, VMJeyakumar, MCarlson, KEKatzenellenbogen, JA Diarylpropionitrile (DPN) enantiomers: synthesis and evaluation of estrogen receptorß-selective ligands. J Med Chem55:528-37 (2012) 
 
Estrogen receptor
Name:Estrogen receptor
Type:Protein
Mol. Mass.:66230.44
Organism:Homo sapiens (Human)
Description:P03372
Residue:595
BDBM50364076
NameBDBM50364076
Synonyms:CHEMBL198159
TypeSmall organic molecule
Emp. Form.C15H13NO2
Mol. Mass.239.2692
SMILESOc1ccc(C[C@@H](C#N)c2ccc(O)cc2)cc1