Reaction Details
TargetEstrogen receptor beta
LigandBDBM50364075
Substrate/Competitorn/a
Meas. Tech.ChEMBL_803011 (CHEMBL1954168)
Ki 1.82±n/a nM
Citation Carroll, VMJeyakumar, MCarlson, KEKatzenellenbogen, JA Diarylpropionitrile (DPN) enantiomers: synthesis and evaluation of estrogen receptorß-selective ligands. J Med Chem55:528-37 (2012) 
 
Estrogen receptor beta
Name:Estrogen receptor beta
Type:PROTEIN
Mol. Mass.:59173.80
Organism:Rattus norvegicus
Description:ChEMBL_803011
Residue:530
BDBM50364075
NameBDBM50364075
Synonyms:CHEMBL1950809
TypeSmall organic molecule
Emp. Form.C15H13NO2
Mol. Mass.239.2692
SMILESOc1ccc(C[C@H](C#N)c2ccc(O)cc2)cc1