Reaction Details
TargetCannabinoid receptor 2
LigandBDBM50364085
Substrate/Competitorn/a
Meas. Tech.ChEMBL_803200 (CHEMBL1954911)
EC50 1.2±n/a nM
Citation Gijsen, HJDe Cleyn, MASurkyn, MVan Lommen, GRVerbist, BMNijsen, MJMeert, TWauwe, JVAerssens, J 5-sulfonyl-benzimidazoles as selective CB2 agonists-part 2. Bioorg Med Chem Lett22:547-52 (2011) 
 
Cannabinoid receptor 2
Name:Cannabinoid receptor 2
Type:G Protein-Coupled Receptor (GPCR)
Mol. Mass.:39690.94
Organism:Homo sapiens (Human)
Description:P34972
Residue:360
BDBM50364085
NameBDBM50364085
Synonyms:CHEMBL1950832
TypeSmall organic molecule
Emp. Form.C25H33N3O5S
Mol. Mass.487.612
SMILESCC(C)(C)c1nc2cc(ccc2n1CC1CCOCC1)S(=O)(=O)c1ccnc(OCCCO)c1