Reaction Details
TargetCannabinoid receptor 2
LigandBDBM50364089
Substrate/Competitorn/a
Meas. Tech.ChEMBL_803200 (CHEMBL1954911)
EC50 240±n/a nM
Citation Gijsen, HJDe Cleyn, MASurkyn, MVan Lommen, GRVerbist, BMNijsen, MJMeert, TWauwe, JVAerssens, J 5-sulfonyl-benzimidazoles as selective CB2 agonists-part 2. Bioorg Med Chem Lett22:547-52 (2011) 
 
Cannabinoid receptor 2
Name:Cannabinoid receptor 2
Type:G Protein-Coupled Receptor (GPCR)
Mol. Mass.:39690.94
Organism:Homo sapiens (Human)
Description:P34972
Residue:360
BDBM50364089
NameBDBM50364089
Synonyms:CHEMBL1950836
TypeSmall organic molecule
Emp. Form.C21H30F3N3O2S
Mol. Mass.445.542
SMILESCC(C)(C)c1nc2cc(ccc2n1CC1CCNCC1)S(=O)(=O)CCCC(F)(F)F