Reaction Details
Target5-hydroxytryptamine receptor 6
LigandBDBM50364320
Substrate/Competitorn/a
Meas. Tech.ChEMBL_804628 (CHEMBL1953150)
Ki 64±n/a nM
Citation Tripathy, RMcHugh, RJBacon, ERSalvino, JMMorton, GCAimone, LDHuang, ZMathiasen, JRDiCamillo, AHuffman, MJMcKenna, BAKopec, KLu, LDQian, JAngeles, TSConnors, TSpais, CHolskin, BDuzic, ESchaffhauser, HRossé, GC Discovery of 7-arylsulfonyl-1,2,3,4, 4a,9a-hexahydro-benzo[4,5]furo[2,3-c]pyridines: identification of a potent and selective 5-HT6 receptor antagonist showing activity in rat social recognition test. Bioorg Med Chem Lett22:1421-6 (2012) 
 
5-hydroxytryptamine receptor 6
Name:5-hydroxytryptamine receptor 6
Type:G Protein-Coupled Receptor (GPCR)
Mol. Mass.:46968.43
Organism:Homo sapiens (Human)
Description:P50406
Residue:440
BDBM50364320
NameBDBM50364320
Synonyms:CHEMBL1949772
TypeSmall organic molecule
Emp. Form.C18H19NO3S
Mol. Mass.329.413
SMILESCc1ccc(cc1)S(=O)(=O)c1ccc2[C@@H]3CCNC[C@@H]3Oc2c1