Reaction Details
TargetCarbonic anhydrase
LigandBDBM26979
Substrate/Competitorn/a
Meas. Tech.ChEMBL_804821 (CHEMBL1953640)
Ki 460000±n/a nM
Citation Ohradanova, AVullo, DPastorekova, SPastorek, JJackson, DJWörheide, GSupuran, CT Anion inhibition studies of ana-carbonic anhydrase from the living fossil Astrosclera willeyana. Bioorg Med Chem Lett22:1314-6 (2012) 
 
Carbonic anhydrase
Name:Carbonic anhydrase
Synonyms:Astrosclerin-3
Type:PROTEIN
Mol. Mass.:33233.07
Organism:Astrosclera willeyana
Description:ChEMBL_801827
Residue:292
BDBM26979
NameBDBM26979
TypeIon
Emp. Form.Cl
Mol. Mass.35.454
SMILES[Cl-]