Reaction Details
TargetCytochrome P450 3A4
LigandBDBM50364334
Substrate/Competitorn/a
Meas. Tech.ChEMBL_804823 (CHEMBL1953642)
IC50 800±n/a nM
Citation McElroy, WTTan, ZBasu, KYang, SWSmotryski, JHo, GDTulshian, DGreenlee, WJMullins, DGuzzi, MZhang, XBleickardt, CHodgson, R Pyrazoloquinolines as PDE10A inhibitors: discovery of a tool compound. Bioorg Med Chem Lett22:1335-9 (2012) 
 
Cytochrome P450 3A4
Name:Cytochrome P450 3A4
Type:Enzyme
Mol. Mass.:57349.57
Organism:Homo sapiens (Human)
Description:n/a
Residue:503
BDBM50364334
NameBDBM50364334
Synonyms:CHEMBL1950090
TypeSmall organic molecule
Emp. Form.C17H16ClN5O
Mol. Mass.341.795
SMILESCc1n[nH]c2nc3c(C)cc(Cl)cc3c(C(O)c3cncn3C)c12