Reaction Details
TargetCytochrome P450 3A4
LigandBDBM50364336
Substrate/Competitorn/a
Meas. Tech.ChEMBL_804823 (CHEMBL1953642)
IC50>20000±n/a nM
Citation McElroy, WTTan, ZBasu, KYang, SWSmotryski, JHo, GDTulshian, DGreenlee, WJMullins, DGuzzi, MZhang, XBleickardt, CHodgson, R Pyrazoloquinolines as PDE10A inhibitors: discovery of a tool compound. Bioorg Med Chem Lett22:1335-9 (2012) 
 
Cytochrome P450 3A4
Name:Cytochrome P450 3A4
Type:Enzyme
Mol. Mass.:57349.57
Organism:Homo sapiens (Human)
Description:n/a
Residue:503
BDBM50364336
NameBDBM50364336
Synonyms:CHEMBL1950088
TypeSmall organic molecule
Emp. Form.C18H14ClFN4O
Mol. Mass.356.781
SMILESCc1n[nH]c2nc3c(C)cc(Cl)cc3c(C(O)c3ccnc(F)c3)c12