Reaction Details
TargetcAMP and cAMP-inhibited cGMP 3',5'-cyclic phosphodiesterase 10A
LigandBDBM50364334
Substrate/Competitorn/a
Meas. Tech.ChEMBL_804822 (CHEMBL1953641)
Ki 21±n/a nM
Citation McElroy, WTTan, ZBasu, KYang, SWSmotryski, JHo, GDTulshian, DGreenlee, WJMullins, DGuzzi, MZhang, XBleickardt, CHodgson, R Pyrazoloquinolines as PDE10A inhibitors: discovery of a tool compound. Bioorg Med Chem Lett22:1335-9 (2012) 
 
cAMP and cAMP-inhibited cGMP 3',5'-cyclic phosphodiesterase 10A
Name:cAMP and cAMP-inhibited cGMP 3',5'-cyclic phosphodiesterase 10A
Type:Protein
Mol. Mass.:88412.52
Organism:Homo sapiens (Human)
Description:Q9Y233
Residue:1055
BDBM50364334
NameBDBM50364334
Synonyms:CHEMBL1950090
TypeSmall organic molecule
Emp. Form.C17H16ClN5O
Mol. Mass.341.795
SMILESCc1n[nH]c2nc3c(C)cc(Cl)cc3c(C(O)c3cncn3C)c12