Reaction Details
TargetcAMP and cAMP-inhibited cGMP 3',5'-cyclic phosphodiesterase 10A
LigandBDBM50364331
Substrate/Competitorn/a
Meas. Tech.ChEMBL_804822 (CHEMBL1953641)
Ki 21±n/a nM
Citation McElroy, WTTan, ZBasu, KYang, SWSmotryski, JHo, GDTulshian, DGreenlee, WJMullins, DGuzzi, MZhang, XBleickardt, CHodgson, R Pyrazoloquinolines as PDE10A inhibitors: discovery of a tool compound. Bioorg Med Chem Lett22:1335-9 (2012) 
 
cAMP and cAMP-inhibited cGMP 3',5'-cyclic phosphodiesterase 10A
Name:cAMP and cAMP-inhibited cGMP 3',5'-cyclic phosphodiesterase 10A
Type:Protein
Mol. Mass.:88412.52
Organism:Homo sapiens (Human)
Description:Q9Y233
Residue:1055
BDBM50364331
NameBDBM50364331
Synonyms:CHEMBL1949941
TypeSmall organic molecule
Emp. Form.C18H19N5O2
Mol. Mass.337.3758
SMILESCOc1cc(C)c2nc3[nH]nc(C)c3c(C(O)c3cncn3C)c2c1